BDBM250593 US10167273, Example 72::US10544126, Example 72::US11512066, Example 72::US9475795, 72
SMILES Cc1nn(C)c(C)c1S(=O)(=O)N1CCC(Cc2ccc(Cl)c(F)c2)CC1
InChI Key InChIKey=AYWHPILLEOWBLQ-UHFFFAOYSA-N
Data  4 IC50
  Tab Delimited (TSV)   2D SDfile   Computed 3D by Vconf -m prep SDfile
Find this compound or compounds like it in BindingDB:
Activity Spreadsheet -- Enzyme Inhibition Constant Data from BindingDB
Found 4 hits for monomerid = 250593
TargetProkineticin receptor 1(Homo sapiens (Human))
Takeda Pharmaceutical
US Patent
LigandPNGBDBM250593(US10167273, Example 72 | US10544126, Example 72 | ...)
Affinity DataIC50:  440nMpH: 7.4 T: 2°C. Assay description: Prokineticin receptor 1 (PKR1) antagonists may be functionally assessed by measurement of change in intracellular calcium levels induced by Gq mediat...
Ligand InfoPC cidPC sid
In DepthDetails US Patent
TargetProkineticin receptor 1(Homo sapiens (Human))
Takeda Pharmaceutical
US Patent
LigandPNGBDBM250593(US10167273, Example 72 | US10544126, Example 72 | ...)
Affinity DataIC50:  440nM. Assay description: The ability of a compound to block the intracellular release of calcium mediated by PK1 in RBL2H3 cells expressing human PKR1 receptors is determined...
Ligand InfoPC cidPC sid
In DepthDetails US Patent
TargetProkineticin receptor 1(Homo sapiens (Human))
Takeda Pharmaceutical
US Patent
LigandPNGBDBM250593(US10167273, Example 72 | US10544126, Example 72 | ...)
Affinity DataIC50:  440nM. Assay description: Prokineticin receptor 1 (PKR1) antagonists may be functionally assessed by measurement of change in intracellular calcium levels induced by Gq mediat...
Ligand InfoPC cidPC sid
In DepthDetails US Patent
TargetProkineticin receptor 1(Homo sapiens (Human))
Takeda Pharmaceutical
US Patent
LigandPNGBDBM250593(US10167273, Example 72 | US10544126, Example 72 | ...)
Affinity DataIC50:  440nM. Assay description: Prokineticin receptor 1 (PKR1) antagonists may be functionally assessed by measurement of change in intracellular calcium levels induced by Gq mediat...
Ligand InfoPC cidPC sid
In DepthDetails US Patent