BDBM251889 US9475809, 1::US9918969, 1
SMILES Clc1cccc(c1)-c1cc(=O)n(CC(=O)Nc2ccc(cc2)-c2nnn[nH]2)c2CNC(=O)c12
InChI Key InChIKey=BUVUMAPNDQFBAF-UHFFFAOYSA-N
Data  2 IC50
  Tab Delimited (TSV)   2D SDfile   Computed 3D by Vconf -m prep SDfile
Find this compound or compounds like it in BindingDB:
Activity Spreadsheet -- Enzyme Inhibition Constant Data from BindingDB
Found 2 hits for monomerid = 251889
TargetCoagulation factor XI(Homo sapiens (Human))
Bayer Pharma Aktiengesellschaft
US Patent
LigandPNGBDBM251889(US9475809, 1 | US9918969, 1)
Affinity DataIC50:  930nM. Assay description: The factor XIa inhibition of the inventive substances is determined using a biochemical test system which utilizes the reaction of a peptidic factor ...
Ligand InfoPC cidPC sid
In DepthDetails US Patent
TargetCoagulation factor XI(Homo sapiens (Human))
Bayer Pharma Aktiengesellschaft
US Patent
LigandPNGBDBM251889(US9475809, 1 | US9918969, 1)
Affinity DataIC50:  930nMpH: 7.4 T: 2°C. Assay description: The factor XIa inhibition of the inventive substances is determined using a biochemical test system which utilizes the reaction of a peptidic factor ...
Ligand InfoPC cidPC sid
In DepthDetails US Patent