BDBM252422 US9458113, 19.2
SMILES Cn1cc(cn1)-c1cc(ccc1C1NC(=O)N(C2=C1C(=O)CC2)c1cccc(c1)C(F)(F)F)C#N
InChI Key InChIKey=YZWGGEYSZUUVJC-UHFFFAOYSA-N
Data  1 IC50
  Tab Delimited (TSV)   2D SDfile   Computed 3D by Vconf -m prep SDfile
Find this compound or compounds like it in BindingDB:
Activity Spreadsheet -- Enzyme Inhibition Constant Data from BindingDB
Found 1 hit for monomerid = 252422
TargetNeutrophil elastase(Homo sapiens (Human))
Boehringer Ingelheim International
US Patent
LigandPNGBDBM252422(US9458113, 19.2)
Affinity DataIC50:  4.80nMpH: 7.5 T: 2°C. Assay description: The following buffers were used: Compound buffer: 100 mM Tris, 500 mM NaCl, adjusted to pH 7.5; Assay buffer: 100 mM Tris, 500 mM NaCl, adjusted to p...
Ligand InfoPC cidPC sid
In DepthDetails US Patent