BDBM253542 US9458171, 502
SMILES OC1(CCS(=O)(=O)CC1)C(=O)N1CC[C@](C1)(c1ccc(cc1)C(F)(C(F)(F)F)C(F)(F)F)S(=O)(=O)c1ccc(F)cc1
InChI Key InChIKey=YNNSWDHDROBVBW-QFIPXVFZSA-N
Data  1 IC50  6 EC50
  Tab Delimited (TSV)   2D SDfile   Computed 3D by Vconf -m prep SDfile
Find this compound or compounds like it in BindingDB:
Activity Spreadsheet -- Enzyme Inhibition Constant Data from BindingDB
Found 7 hits for monomerid = 253542
TargetNuclear receptor ROR-gamma [262-507](Homo sapiens (Human))
Bristol-Myers Squibb
US Patent
LigandPNGBDBM253542(US9458171, 502)
Affinity DataIC50:  29nMT: 2°C. Assay description: The binding of potential ligands to RORγ is measured by competition with [3H] 25-hydroxycholesterol (Perkin Elmer NET674250UC) using a scintill...
Ligand InfoPC cidPC sid
In DepthDetails US Patent
TargetOxysterols receptor LXR-beta(Homo sapiens (Human))
Bristol-Myers Squibb
Curated by ChEMBL
LigandPNGBDBM253542(US9458171, 502)
Affinity DataEC50: >7.50E+3nM. Assay description: Transactivation of human GAL4-fused LXRbeta expressed in African green monkey CV1 cells
Ligand InfoPC cidPC sid
In DepthDetails ArticlePubMed
TargetNuclear receptor ROR-alpha(Homo sapiens (Human))
Bristol-Myers Squibb
Curated by ChEMBL
LigandPNGBDBM253542(US9458171, 502)
Affinity DataEC50: >4.00E+4nM. Assay description: Inverse agonist activity at human Gal4-fused RORalpha LBD (272 to 556 residues) expressed in human Jurkat cells measured after 18 hrs by steady-glo l...
Ligand InfoPC cidPC sid
In DepthDetails ArticlePubMed
TargetNuclear receptor ROR-gamma(Homo sapiens (Human))
Bristol-Myers Squibb
Curated by ChEMBL
LigandPNGBDBM253542(US9458171, 502)
Affinity DataEC50:  123nM. Assay description: Inverse agonist activity at human Gal4-fused RORgammat LBD (267 to 516 residues) expressed in human Jurkat cells measured after 18 hrs by steady-glo ...
Ligand InfoPC cidPC sid
In DepthDetails ArticlePubMed
TargetNuclear receptor ROR-beta(Homo sapiens (Human))
Bristol-Myers Squibb
Curated by ChEMBL
LigandPNGBDBM253542(US9458171, 502)
Affinity DataEC50: >4.00E+4nM. Assay description: Inverse agonist activity at human Gal4-fused RORbeta LBD (200 to 559 residues) expressed in human Jurkat cells measured after 18 hrs by steady-glo lu...
Ligand InfoPC cidPC sid
In DepthDetails ArticlePubMed
TargetOxysterols receptor LXR-alpha(Homo sapiens (Human))
Bristol-Myers Squibb
Curated by ChEMBL
LigandPNGBDBM253542(US9458171, 502)
Affinity DataEC50: >7.50E+3nM. Assay description: Transactivation of human GAL4-fused LXRalpha expressed in African green monkey CV1 cells
Ligand InfoPC cidPC sid
In DepthDetails ArticlePubMed
TargetNuclear receptor subfamily 1 group I member 2(Homo sapiens (Human))
Bristol-Myers Squibb
Curated by ChEMBL
LigandPNGBDBM253542(US9458171, 502)
Affinity DataEC50: >5.00E+4nM. Assay description: Transactivation of PXR (unknown origin) expressed in human HepG2 cells
Ligand InfoPC cidPC sid
In DepthDetails ArticlePubMed