BDBM255639 US9475815, 24
SMILES COc1cc(C)cc2cc(sc12)-c1cc(CN2CCC3CN(C)CC23)n2ncnc(N)c12
InChI Key InChIKey=VWYVSMZNNKETET-UHFFFAOYSA-N
Data  2 IC50
  Tab Delimited (TSV)   2D SDfile   Computed 3D by Vconf -m prep SDfile
Find this compound or compounds like it in BindingDB:
Activity Spreadsheet -- Enzyme Inhibition Constant Data from BindingDB
Found 2 hits for monomerid = 255639
TargetFibroblast growth factor receptor 1 [400-80]/Glutathione S-transferase P(Homo sapiens (Human))
Bayer Intelletual Property
US Patent
LigandPNGBDBM255639(US9475815, 24)
Affinity DataIC50:  34.1nMpH: 7.0 T: 2°C. Assay description: A recombinant tagged FGFR-1 fusion protein [fusion of glutathione-S-transferase (GST) (N-terminally), His6-tag, thrombin cleavage site, and the intra...
Ligand InfoPC cidPC sid
In DepthDetails US Patent
TargetFibroblast growth factor receptor 3 [397-806]/Glutathione S-transferase P(Homo sapiens (Human))
Bayer Intelletual Property
US Patent
LigandPNGBDBM255639(US9475815, 24)
Affinity DataIC50:  119nMpH: 7.0 T: 2°C. Assay description: A recombinant tagged FGFR-3 fusion protein [fusion of glutathione-S-transferase (GST) (N-terminally), His6-tag, thrombin cleavage site, and the intra...
Ligand InfoPC cidPC sid
In DepthDetails US Patent