BDBM255662 US9475815, 47
SMILES COc1cc(C)cc2cc(sc12)-c1cc(CN2C[C@@H]3CCCN[C@@H]3C2)n2ncnc(N)c12
InChI Key InChIKey=JUJIEVUEPAPJTH-HNAYVOBHSA-N
Data  1 IC50
  Tab Delimited (TSV)   2D SDfile   Computed 3D by Vconf -m prep SDfile
Find this compound or compounds like it in BindingDB:
Activity Spreadsheet -- Enzyme Inhibition Constant Data from BindingDB
Found 1 hit for monomerid = 255662
TargetFibroblast growth factor receptor 1 [400-80]/Glutathione S-transferase P(Homo sapiens (Human))
Bayer Intelletual Property
US Patent
LigandPNGBDBM255662(US9475815, 47)
Affinity DataIC50:  25.2nMpH: 7.0 T: 2°C. Assay description: A recombinant tagged FGFR-1 fusion protein [fusion of glutathione-S-transferase (GST) (N-terminally), His6-tag, thrombin cleavage site, and the intra...
Ligand InfoPC cidPC sid
In DepthDetails US Patent