BDBM255732 US9475815, 117
SMILES CNCCOCc1cc(-c2cc3cc(C)cc(OC)c3s2)c2c(N)ncnn12
InChI Key InChIKey=PKLNGDAYSGXZCR-UHFFFAOYSA-N
Data  2 IC50
  Tab Delimited (TSV)   2D SDfile   Computed 3D by Vconf -m prep SDfile
Find this compound or compounds like it in BindingDB:
Activity Spreadsheet -- Enzyme Inhibition Constant Data from BindingDB
Found 2 hits for monomerid = 255732
TargetFibroblast growth factor receptor 1 [400-80]/Glutathione S-transferase P(Homo sapiens (Human))
Bayer Intelletual Property
US Patent
LigandPNGBDBM255732(US9475815, 117)
Affinity DataIC50:  36.1nMpH: 7.0 T: 2°C. Assay description: A recombinant tagged FGFR-1 fusion protein [fusion of glutathione-S-transferase (GST) (N-terminally), His6-tag, thrombin cleavage site, and the intra...
Ligand InfoPC cidPC sid
In DepthDetails US Patent
TargetFibroblast growth factor receptor 3 [397-806]/Glutathione S-transferase P(Homo sapiens (Human))
Bayer Intelletual Property
US Patent
LigandPNGBDBM255732(US9475815, 117)
Affinity DataIC50:  34.8nMpH: 7.0 T: 2°C. Assay description: A recombinant tagged FGFR-3 fusion protein [fusion of glutathione-S-transferase (GST) (N-terminally), His6-tag, thrombin cleavage site, and the intra...
Ligand InfoPC cidPC sid
In DepthDetails US Patent