BDBM256481 US10329256, Example 26::US9487512, 26::US9944601, Example 26
SMILES C(N[C@H]1C[C@@H]1c1ccccc1)C1CCNC1
InChI Key InChIKey=SNYUIWMNWQHODY-WLPIGLKUSA-N
Data  9 IC50
  Tab Delimited (TSV)   2D SDfile   Computed 3D by Vconf -m prep SDfile
Find this compound or compounds like it in BindingDB:
Activity Spreadsheet -- Enzyme Inhibition Constant Data from BindingDB
Found 9 hits for monomerid = 256481
TargetAmine oxidase [flavin-containing] A(Homo sapiens (Human))
Oryzon Genomics
US Patent
LigandPNGBDBM256481(US10329256, Example 26 | US9487512, 26 | US9944601...)
Affinity DataIC50: >1.00E+5nMpH: 7.5 T: 2°C. Assay description: Human recombinant monoamine oxidase proteins MAO-A and MAO-B were purchased from Sigma Aldrich. MAOs catalyze the oxidative deamination of primary, s...
Ligand InfoPC cidPC sid
In DepthDetails US Patent
TargetAmine oxidase [flavin-containing] B(Homo sapiens (Human))
Oryzon Genomics
US Patent
LigandPNGBDBM256481(US10329256, Example 26 | US9487512, 26 | US9944601...)
Affinity DataIC50:  2.08E+4nMpH: 7.5 T: 2°C. Assay description: Human recombinant monoamine oxidase proteins MAO-A and MAO-B were purchased from Sigma Aldrich. MAOs catalyze the oxidative deamination of primary, s...
Ligand InfoPC cidPC sid
In DepthDetails US Patent
LigandPNGBDBM256481(US10329256, Example 26 | US9487512, 26 | US9944601...)
Affinity DataIC50:  35nMpH: 7.4 T: 2°C. Assay description: The compounds of the invention can be tested for their ability to inhibit LSD1. The ability of the compounds of the invention to inhibit LSD1 can be ...
Ligand InfoPC cidPC sid
In DepthDetails US Patent
TargetAmine oxidase [flavin-containing] A(Homo sapiens (Human))
Oryzon Genomics
US Patent
LigandPNGBDBM256481(US10329256, Example 26 | US9487512, 26 | US9944601...)
Affinity DataIC50: >1.00E+5nM. Assay description: Human recombinant monoamine oxidase proteins MAO-A and MAO-B were purchased from Sigma Aldrich. MAOs catalyze the oxidative deamination of primary, s...
Ligand InfoPC cidPC sid
In DepthDetails US Patent
TargetLysine-specific histone demethylase 1A(Homo sapiens (Human))
Oryzon Genomics
US Patent
LigandPNGBDBM256481(US10329256, Example 26 | US9487512, 26 | US9944601...)
Affinity DataIC50:  35nM. Assay description: Briefly, a fixed amount of LSD1 was incubated on ice for 15 minutes, in the absence and/or in the presence of at least eight 3-fold serial dilutions ...
Ligand InfoPC cidPC sid
In DepthDetails US Patent
TargetLysine-specific histone demethylase 1A(Homo sapiens (Human))
Oryzon Genomics
US Patent
LigandPNGBDBM256481(US10329256, Example 26 | US9487512, 26 | US9944601...)
Affinity DataIC50:  35nM. Assay description: The compounds of the invention can be tested for their ability to inhibit LSD1. The ability of the compounds of the invention to inhibit LSD1 can be ...
Ligand InfoPC cidPC sid
In DepthDetails US Patent
TargetAmine oxidase [flavin-containing] A(Homo sapiens (Human))
Oryzon Genomics
US Patent
LigandPNGBDBM256481(US10329256, Example 26 | US9487512, 26 | US9944601...)
Affinity DataIC50: >1.00E+5nM. Assay description: Human recombinant monoamine oxidase proteins MAO-A and MAO-B were purchased from Sigma Aldrich. MAOs catalyze the oxidative deamination of primary, s...
Ligand InfoPC cidPC sid
In DepthDetails US Patent
TargetAmine oxidase [flavin-containing] B(Homo sapiens (Human))
Oryzon Genomics
US Patent
LigandPNGBDBM256481(US10329256, Example 26 | US9487512, 26 | US9944601...)
Affinity DataIC50:  2.08E+4nM. Assay description: Human recombinant monoamine oxidase proteins MAO-A and MAO-B were purchased from Sigma Aldrich. MAOs catalyze the oxidative deamination of primary, s...
Ligand InfoPC cidPC sid
In DepthDetails US Patent
TargetAmine oxidase [flavin-containing] B(Homo sapiens (Human))
Oryzon Genomics
US Patent
LigandPNGBDBM256481(US10329256, Example 26 | US9487512, 26 | US9944601...)
Affinity DataIC50:  2.08E+4nM. Assay description: Human recombinant monoamine oxidase proteins MAO-A and MAO-B were purchased from Sigma Aldrich. MAOs catalyze the oxidative deamination of primary, s...
Ligand InfoPC cidPC sid
In DepthDetails US Patent