BDBM260168 US9504692, 3937
SMILES C(CN1c2ccccc2Sc2ccccc12)Cn1ccnc1
InChI Key InChIKey=GOHBDWLLEZQNKY-UHFFFAOYSA-N
Data  1 IC50
  Tab Delimited (TSV)   2D SDfile   Computed 3D by Vconf -m prep SDfile
Find this compound or compounds like it in BindingDB:
Activity Spreadsheet -- Enzyme Inhibition Constant Data from BindingDB
Found 1 hit for monomerid = 260168
LigandPNGBDBM260168(US9504692, 3937)
Affinity DataIC50:  1.75E+4nMT: 2°C. Assay description: To screen for small molecular weight compounds that can inhibit MALT1 protease activity, recombinant GSTMALT1 was purified from E. coli to establish ...
Ligand InfoPC cidPC sid
In DepthDetails US Patent