BDBM260170 US9504692, 4028
SMILES COCCCN1c2ccccc2Sc2ccccc12
InChI Key InChIKey=KNYUOKJVYNSYHV-UHFFFAOYSA-N
Data  1 IC50
  Tab Delimited (TSV)   2D SDfile   Computed 3D by Vconf -m prep SDfile
Find this compound or compounds like it in BindingDB:
Activity Spreadsheet -- Enzyme Inhibition Constant Data from BindingDB
Found 1 hit for monomerid = 260170
LigandPNGBDBM260170(US9504692, 4028)
Affinity DataIC50:  1.25E+4nMT: 2°C. Assay description: To screen for small molecular weight compounds that can inhibit MALT1 protease activity, recombinant GSTMALT1 was purified from E. coli to establish ...
Ligand InfoPC cidPC sid
In DepthDetails US Patent