BDBM260175 US9504692, 3961
SMILES CN1CCCCC(CN2c3ccccc3Sc3ccccc23)C1
InChI Key InChIKey=FHGMLHKZDZZDDW-UHFFFAOYSA-N
Data  1 IC50
  Tab Delimited (TSV)   2D SDfile   Computed 3D by Vconf -m prep SDfile
Find this compound or compounds like it in BindingDB:
Activity Spreadsheet -- Enzyme Inhibition Constant Data from BindingDB
Found 1 hit for monomerid = 260175
LigandPNGBDBM260175(US9504692, 3961)
Affinity DataIC50:  9.69E+3nMT: 2°C. Assay description: To screen for small molecular weight compounds that can inhibit MALT1 protease activity, recombinant GSTMALT1 was purified from E. coli to establish ...
Ligand InfoPC cidPC sid
In DepthDetails US Patent