BDBM260196 US9504692, 4097
SMILES CN1CCCC(CN2c3ccccc3Sc3c(C)cc(C)cc23)C1
InChI Key InChIKey=YVKANEOYMMQPSK-UHFFFAOYSA-N
Data  1 IC50
  Tab Delimited (TSV)   2D SDfile   Computed 3D by Vconf -m prep SDfile
Find this compound or compounds like it in BindingDB:
Activity Spreadsheet -- Enzyme Inhibition Constant Data from BindingDB
Found 1 hit for monomerid = 260196
LigandPNGBDBM260196(US9504692, 4097)
Affinity DataIC50:  3.86E+3nMT: 2°C. Assay description: To screen for small molecular weight compounds that can inhibit MALT1 protease activity, recombinant GSTMALT1 was purified from E. coli to establish ...
Ligand InfoPC cidPC sid
In DepthDetails US Patent