BDBM26103 5-{4-[4-fluoro-3-(trifluoromethyl)phenyl]-2-(propan-2-yl)phenyl}-1,2-oxazole-3-carboxylic acid::Isoxazole carboxylic acid, 18
SMILES CC(C)c1cc(ccc1-c1cc(no1)C(O)=O)-c1ccc(F)c(c1)C(F)(F)F
InChI Key InChIKey=VUPSIGPBBCQNTJ-UHFFFAOYSA-N
Data  1 KI
  Tab Delimited (TSV)   2D SDfile   Computed 3D by Vconf -m prep SDfile
Find this compound or compounds like it in BindingDB:
Activity Spreadsheet -- Enzyme Inhibition Constant Data from BindingDB
Found 1 hit for monomerid = 26103
TargetTYR_PHOSPHATASE_2 domain-containing protein(Mycobacterium tuberculosis)
University Of California Berkeley
LigandPNGBDBM26103(5-{4-[4-fluoro-3-(trifluoromethyl)phenyl]-2-(propa...)
Affinity DataKi:  500nM ΔG°:  -8.50kcal/molepH: 7.4 T: 2°C. Assay description: The reaction was started by addition of pNPP substrate, and reaction progress was monitored at 405 nm. The initial rate data collected was used for d...
In DepthDetails ArticlePubMed