BDBM26148 2,4-dianilino pyrimidine, 5::3-({4-[(3-hydroxy-4-methylphenyl)amino]pyrimidin-2-yl}amino)benzamide
SMILES Cc1ccc(Nc2ccnc(Nc3cccc(c3)C(N)=O)n2)cc1O
InChI Key InChIKey=PKAORYXTBFAULF-UHFFFAOYSA-N
Data  1 IC50
  Tab Delimited (TSV)   2D SDfile   Computed 3D by Vconf -m prep SDfile
Find this compound or compounds like it in BindingDB:
Activity Spreadsheet -- Enzyme Inhibition Constant Data from BindingDB
Found 1 hit for monomerid = 26148
LigandPNGBDBM26148(2,4-dianilino pyrimidine, 5 | 3-({4-[(3-hydroxy-4-...)
Affinity DataIC50:  190nMpH: 7.4 T: 2°C. Assay description: Lck activity was assessed using a TR-FRET assay in a 384-well plate format. The degree of phosphorylation of Biotinylated substrate was measured usin...
In DepthDetails ArticlePubMed