BDBM26404 5-[(2-aminoethyl)amino]-7-[(3,5-dimethoxyphenyl)amino]imidazo[1,2-a]pyrimidine-8-carboxamide::CHEMBL482175::imidazo[1,2-c]pyrimidine-8-carboxamide, 10c
SMILES COc1cc(Nc2nc(NCCN)n3ccnc3c2C(N)=O)cc(OC)c1
InChI Key InChIKey=XJSCJPRKDAUMHP-UHFFFAOYSA-N
Data  4 IC50
  Tab Delimited (TSV)   2D SDfile   Computed 3D by Vconf -m prep SDfile
Find this compound or compounds like it in BindingDB:
Activity Spreadsheet -- Enzyme Inhibition Constant Data from BindingDB
Found 4 hits for monomerid = 26404
TargetTyrosine-protein kinase ZAP-70(Homo sapiens (Human))
Kissei Pharmaceutical
LigandPNGBDBM26404(5-[(2-aminoethyl)amino]-7-[(3,5-dimethoxyphenyl)am...)
Affinity DataIC50:  3.50E+3nMpH: 7.6 T: 2°C. Assay description: A coupled spectrophotometric assay was used wherein ADP generated by ZAP-70 kinase was converted to ATP by pyruvate kinase (PK), with concomitant pro...
In DepthDetails ArticlePubMed
TargetTyrosine-protein kinase ZAP-70(Homo sapiens (Human))
Kissei Pharmaceutical
LigandPNGBDBM26404(5-[(2-aminoethyl)amino]-7-[(3,5-dimethoxyphenyl)am...)
Affinity DataIC50:  3.50E+3nM. Assay description: Inhibition of human ZAP70 expressed in Sf9 cells
In DepthDetails ArticlePubMed
TargetTyrosine-protein kinase SYK(Homo sapiens (Human))
Kissei Pharmaceutical
Curated by ChEMBL
LigandPNGBDBM26404(5-[(2-aminoethyl)amino]-7-[(3,5-dimethoxyphenyl)am...)
Affinity DataIC50:  230nM. Assay description: Inhibition of human Syk expressed in Sf9 cells
In DepthDetails ArticlePubMed
TargetTyrosine-protein kinase SYK(Homo sapiens (Human))
Kissei Pharmaceutical
Curated by ChEMBL
LigandPNGBDBM26404(5-[(2-aminoethyl)amino]-7-[(3,5-dimethoxyphenyl)am...)
Affinity DataIC50:  230nM. Assay description: A coupled spectrophotometric assay was used, wherein ADP generated by Syk kinase was converted to ATP by pyruvate kinase (PK), with concomitant produ...
In DepthDetails ArticlePubMed