BDBM26422 4-[({8-carbamoyl-7-[(3,5-dimethoxyphenyl)amino]imidazo[1,2-a]pyrimidin-5-yl}amino)methyl]benzoic acid::imidazo[1,2-c]pyrimidine-8-carboxamide, 11
SMILES COc1cc(Nc2nc(NCc3ccc(cc3)C(O)=O)n3ccnc3c2C(N)=O)cc(OC)c1
InChI Key InChIKey=XLQAOMGZOHXTTH-UHFFFAOYSA-N
Data  2 IC50
  Tab Delimited (TSV)   2D SDfile   Computed 3D by Vconf -m prep SDfile
Find this compound or compounds like it in BindingDB:
Activity Spreadsheet -- Enzyme Inhibition Constant Data from BindingDB
Found 2 hits for monomerid = 26422
TargetTyrosine-protein kinase SYK(Homo sapiens (Human))
Kissei Pharmaceutical
LigandPNGBDBM26422(4-[({8-carbamoyl-7-[(3,5-dimethoxyphenyl)amino]imi...)
Affinity DataIC50:  8.10E+3nM. Assay description: A coupled spectrophotometric assay was used, wherein ADP generated by Syk kinase was converted to ATP by pyruvate kinase (PK), with concomitant produ...
In DepthDetails ArticlePubMed
TargetTyrosine-protein kinase ZAP-70(Homo sapiens (Human))
Kissei Pharmaceutical
LigandPNGBDBM26422(4-[({8-carbamoyl-7-[(3,5-dimethoxyphenyl)amino]imi...)
Affinity DataIC50:  180nMpH: 7.6 T: 2°C. Assay description: A coupled spectrophotometric assay was used wherein ADP generated by ZAP-70 kinase was converted to ATP by pyruvate kinase (PK), with concomitant pro...
In DepthDetails ArticlePubMed