BDBM26425 imidazo[1,2-c]pyrimidine-8-carboxamide, 20::tert-butyl 2-{4-[({8-carbamoyl-7-[(3,5-dimethoxyphenyl)amino]imidazo[1,2-a]pyrimidin-5-yl}amino)methyl]phenyl}acetate
SMILES COc1cc(Nc2nc(NCc3ccc(CC(=O)OC(C)(C)C)cc3)n3ccnc3c2C(N)=O)cc(OC)c1
InChI Key InChIKey=ODGKOKWUUQQWAV-UHFFFAOYSA-N
Data  2 IC50
  Tab Delimited (TSV)   2D SDfile   Computed 3D by Vconf -m prep SDfile
Find this compound or compounds like it in BindingDB:
Activity Spreadsheet -- Enzyme Inhibition Constant Data from BindingDB
Found 2 hits for monomerid = 26425
TargetTyrosine-protein kinase SYK(Homo sapiens (Human))
Kissei Pharmaceutical
LigandPNGBDBM26425(imidazo[1,2-c]pyrimidine-8-carboxamide, 20 | tert-...)
Affinity DataIC50: >1.00E+4nM. Assay description: A coupled spectrophotometric assay was used, wherein ADP generated by Syk kinase was converted to ATP by pyruvate kinase (PK), with concomitant produ...
In DepthDetails ArticlePubMed
TargetTyrosine-protein kinase ZAP-70(Homo sapiens (Human))
Kissei Pharmaceutical
LigandPNGBDBM26425(imidazo[1,2-c]pyrimidine-8-carboxamide, 20 | tert-...)
Affinity DataIC50:  3.20E+3nMpH: 7.6 T: 2°C. Assay description: A coupled spectrophotometric assay was used wherein ADP generated by ZAP-70 kinase was converted to ATP by pyruvate kinase (PK), with concomitant pro...
In DepthDetails ArticlePubMed