BDBM2699 3-[2-(aminomethyl)-1H,2H,3H-benzo[b]pyrrolizin-9-yl]-4-(1-methyl-1H-indol-3-yl)-2,5-dihydro-1H-pyrrole-2,5-dione::Bisindolylmaleimide deriv. 9a::ROCHE screening, 61
SMILES Cn1cc(C2=C(C(=O)NC2=O)c2c3CC(CN)Cn3c3ccccc23)c2ccccc12
InChI Key InChIKey=NMGBFXCDTNEKFF-UHFFFAOYSA-N
Data  3 IC50
  Tab Delimited (TSV)   2D SDfile   Computed 3D by Vconf -m prep SDfile
Find this compound or compounds like it in BindingDB:
Activity Spreadsheet -- Enzyme Inhibition Constant Data from BindingDB
Found 3 hits for monomerid = 2699
TargetProtein kinase C beta type(Rattus norvegicus (rat))
Roche Products
LigandPNGBDBM2699(3-[2-(aminomethyl)-1H,2H,3H-benzo[b]pyrrolizin-9-y...)
Affinity DataIC50:  14nMpH: 7.5 T: 2°C. Assay description: The activity of PKC, activated by phosphatidylerine and Ca2+, is measured by its ability to transfer phosphate from [gamma-32P]ATP to lysine-rich his...
In DepthDetails ArticlePubMed
TargetSerine/threonine-protein kinase TBK1(Homo sapiens (Human))
Technical University of Dortmund
LigandPNGBDBM2699(3-[2-(aminomethyl)-1H,2H,3H-benzo[b]pyrrolizin-9-y...)
Affinity DataIC50:  5.62E+3nM. Assay description: IC50 determinations for TBK1 were performed with the KinEASE-STK assay from Cisbio according to the manufacturer's instructions. A biotinylated s...
In DepthDetails ArticlePubMed
TargetcAMP-dependent protein kinase catalytic subunit alpha(Bos taurus (bovine))
Roche Products
LigandPNGBDBM2699(3-[2-(aminomethyl)-1H,2H,3H-benzo[b]pyrrolizin-9-y...)
Affinity DataIC50:  3.90E+3nMpH: 8.5 T: 2°C. Assay description: The activity of PKA, activated by cAMP, is measured by its ability to transfer phosphate from [gamma-32P]ATP to histone.
In DepthDetails ArticlePubMed