BDBM2704 3-[8-(aminomethyl)-6H,7H,8H,9H,10H-azepino[1,2-a]indol-11-yl]-4-(1-methyl-1H-indol-3-yl)-2,5-dihydro-1H-pyrrole-2,5-dione::Bisindolylmaleimide deriv. 9f
SMILES Cn1cc(C2=C(C(=O)NC2=O)c2c3CCC(CN)CCn3c3ccccc23)c2ccccc12
InChI Key InChIKey=KHZQIBLXYBPFAA-UHFFFAOYSA-N
Data  2 IC50
  Tab Delimited (TSV)   2D SDfile   Computed 3D by Vconf -m prep SDfile
Find this compound or compounds like it in BindingDB:
Activity Spreadsheet -- Enzyme Inhibition Constant Data from BindingDB
Found 2 hits for monomerid = 2704
TargetcAMP-dependent protein kinase catalytic subunit alpha(Bos taurus (bovine))
Roche Products
LigandPNGBDBM2704(3-[8-(aminomethyl)-6H,7H,8H,9H,10H-azepino[1,2-a]i...)
Affinity DataIC50:  2.60E+3nMpH: 8.5 T: 2°C. Assay description: The activity of PKA, activated by cAMP, is measured by its ability to transfer phosphate from [gamma-32P]ATP to histone.
In DepthDetails ArticlePubMed
TargetProtein kinase C beta type(Rattus norvegicus (rat))
Roche Products
LigandPNGBDBM2704(3-[8-(aminomethyl)-6H,7H,8H,9H,10H-azepino[1,2-a]i...)
Affinity DataIC50:  16.5nMpH: 7.5 T: 2°C. Assay description: The activity of PKC, activated by phosphatidylerine and Ca2+, is measured by its ability to transfer phosphate from [gamma-32P]ATP to lysine-rich his...
In DepthDetails ArticlePubMed