BDBM27386 2-phenyl-1H,4H,5H,6H,7H-pyrrolo[3,2-c]pyridin-4-one::pyrrolopyridinone scaffold, 8
SMILES O=C1NCCc2[nH]c(cc12)-c1ccccc1
InChI Key InChIKey=XYWBECNOAGWDMX-UHFFFAOYSA-N
Data  1 IC50
  Tab Delimited (TSV)   2D SDfile   Computed 3D by Vconf -m prep SDfile
Find this compound or compounds like it in BindingDB:
Activity Spreadsheet -- Enzyme Inhibition Constant Data from BindingDB
Found 1 hit for monomerid = 27386
TargetCell division cycle 7-related protein kinase [58-574]/Protein DBF4 homolog A(Homo sapiens (Human))
Nerviano Medical Sciences
LigandPNGBDBM27386(2-phenyl-1H,4H,5H,6H,7H-pyrrolo[3,2-c]pyridin-4-on...)
Affinity DataIC50: >5.00E+3nMpH: 7.9 T: 2°C. Assay description: The potency of the compound toward kinase activity was determined using a Dowex resin-based assay. The substrate was phosphorylated by kinase in the ...
In DepthDetails ArticlePubMed