BDBM27400 1-ethyl-2-(pyridin-4-yl)-1H,4H,5H,6H,7H-pyrrolo[3,2-c]pyridin-4-one::pyrrolopyridinone scaffold, 22
SMILES CCn1c2CCNC(=O)c2cc1-c1ccncc1
InChI Key InChIKey=RVODROMIHSQWCT-UHFFFAOYSA-N
Data  2 KI  5 IC50
  Tab Delimited (TSV)   2D SDfile   Computed 3D by Vconf -m prep SDfile
Find this compound or compounds like it in BindingDB:
Activity Spreadsheet -- Enzyme Inhibition Constant Data from BindingDB
Found 7 hits for monomerid = 27400
TargetSerine/threonine-protein kinase N2(Homo sapiens (Human))
University Of Sussex
Curated by ChEMBL
LigandPNGBDBM27400(1-ethyl-2-(pyridin-4-yl)-1H,4H,5H,6H,7H-pyrrolo[3,...)
Affinity DataKi:  8nM. Assay description: Inhibition of PKN2 (unknown origin) by TR-FRET-based tracer displacement assay dependent Cheng-Prusoff equation analysis
In DepthDetails PubMed
TargetSerine/threonine-protein kinase N1(Homo sapiens (Human))
University Of Sussex
Curated by ChEMBL
LigandPNGBDBM27400(1-ethyl-2-(pyridin-4-yl)-1H,4H,5H,6H,7H-pyrrolo[3,...)
Affinity DataKi:  108nM. Assay description: Inhibition of PKN1 (unknown origin) by TR-FRET-based tracer displacement assay dependent Cheng-Prusoff equation analysis
In DepthDetails PubMed
TargetSerine/threonine-protein kinase N2(Homo sapiens (Human))
University Of Sussex
Curated by ChEMBL
LigandPNGBDBM27400(1-ethyl-2-(pyridin-4-yl)-1H,4H,5H,6H,7H-pyrrolo[3,...)
Affinity DataIC50:  16nM. Assay description: Inhibition of PKN2 (unknown origin) by TR-FRET-based tracer displacement assay
In DepthDetails PubMed
TargetSerine/threonine-protein kinase N2(Homo sapiens (Human))
University Of Sussex
Curated by ChEMBL
LigandPNGBDBM27400(1-ethyl-2-(pyridin-4-yl)-1H,4H,5H,6H,7H-pyrrolo[3,...)
Affinity DataIC50:  1.10E+3nM. Assay description: Inhibition of NanoLuc-PKN2 (ser646-cys984)(unknown origin) expressed in HEK293 cells in absence of tracer by cell-based NanoBRET target engagement as...
In DepthDetails PubMed
TargetSerine/threonine-protein kinase N1(Homo sapiens (Human))
University Of Sussex
Curated by ChEMBL
LigandPNGBDBM27400(1-ethyl-2-(pyridin-4-yl)-1H,4H,5H,6H,7H-pyrrolo[3,...)
Affinity DataIC50:  210nM. Assay description: Inhibition of PKN1 (unknown origin) by TR-FRET-based tracer displacement assay
In DepthDetails PubMed
TargetSerine/threonine-protein kinase N2(Homo sapiens (Human))
University Of Sussex
Curated by ChEMBL
LigandPNGBDBM27400(1-ethyl-2-(pyridin-4-yl)-1H,4H,5H,6H,7H-pyrrolo[3,...)
Affinity DataIC50:  2.10E+3nM. Assay description: Inhibition of NanoLuc-PKN2 (ser646-cys984)(unknown origin) expressed in HEK293 cells by cell-based NanoBRET target engagement assay
In DepthDetails PubMed
TargetCell division cycle 7-related protein kinase [58-574]/Protein DBF4 homolog A(Homo sapiens (Human))
Nerviano Medical Sciences
LigandPNGBDBM27400(1-ethyl-2-(pyridin-4-yl)-1H,4H,5H,6H,7H-pyrrolo[3,...)
Affinity DataIC50:  67nMpH: 7.9 T: 2°C. Assay description: The potency of the compound toward kinase activity was determined using a Dowex resin-based assay. The substrate was phosphorylated by kinase in the ...
In DepthDetails ArticlePubMed