BDBM274292 6-(4-chlorophenyl)-5-(3,7-dimethyl-3H-[1,2,3]triazolo[4,5-b]pyridin-5-yl)-N,1-dimethyl-4-oxo-1,4,5,6-tetrahydropyrrolo[3,4-b]pyrrole-3-carboxamide::US9550796, Example 93
SMILES CNC(=O)c1cn(C)c2C(N(C(=O)c12)c1cc(C)c2nnn(C)c2n1)c1ccc(Cl)cc1
InChI Key InChIKey=DDRRENHDNHGPEG-UHFFFAOYSA-N
Data  4 IC50
  Tab Delimited (TSV)   2D SDfile   Computed 3D by Vconf -m prep SDfile
Find this compound or compounds like it in BindingDB:
Activity Spreadsheet -- Enzyme Inhibition Constant Data from BindingDB
Found 4 hits for monomerid = 274292
TargetBromodomain-containing protein 4 [44-477](Homo sapiens (Human))
Novartis
US Patent
LigandPNGBDBM274292(6-(4-chlorophenyl)-5-(3,7-dimethyl-3H-[1,2,3]triaz...)
Affinity DataIC50:  13nMpH: 7.5Assay Description:All assays were performed in 384-well microtiter plates. Each assay plate contained 8-point serial dilutions for 40 test compounds, plus 16 high- and...
Ligand InfoPC cidPC sid
In DepthDetails US Patent
TargetCREB-binding protein(Homo sapiens (Human))
Novartis
US Patent
LigandPNGBDBM274292(6-(4-chlorophenyl)-5-(3,7-dimethyl-3H-[1,2,3]triaz...)
Affinity DataIC50: >3.70E+4nMpH: 7.5 T: 2°C. Assay description: All assays were performed in 384-well microtiter plates. Each assay plate contained 8-point serial dilutions for 40 test compounds, plus 16 high- and...
Ligand InfoPC cidPC sid
In DepthDetails US Patent
TargetBromodomain-containing protein 3(Homo sapiens (Human))
Novartis
US Patent
LigandPNGBDBM274292(6-(4-chlorophenyl)-5-(3,7-dimethyl-3H-[1,2,3]triaz...)
Affinity DataIC50:  14nMpH: 7.5Assay Description:All assays were performed in 384-well microtiter plates. Each assay plate contained 8-point serial dilutions for 40 test compounds, plus 16 high- and...
Ligand InfoPC cidPC sid
In DepthDetails US Patent
TargetBromodomain-containing protein 2 [60-463](Homo sapiens (Human))
Novartis
US Patent
LigandPNGBDBM274292(6-(4-chlorophenyl)-5-(3,7-dimethyl-3H-[1,2,3]triaz...)
Affinity DataIC50:  15nMpH: 7.5Assay Description:All assays were performed in 384-well microtiter plates. Each assay plate contained 8-point serial dilutions for 40 test compounds, plus 16 high- and...
Ligand InfoPC cidPC sid
In DepthDetails US Patent