BDBM274324 Ethyl 6-(4-chlorophenyl)-3-cyclopropyl-5-(3,8-dimethyl-[1,2,4]triazolo[4,3-a]pyridin-6-yl)-4-oxo-5,6-dihydropyrrolo[3,4-b]pyrrole-1(4H)-carboxylate::US9550796, Example 125
SMILES CCOC(=O)n1cc(C2CC2)c2C(=O)N(C(c12)c1ccc(Cl)cc1)c1cc(C)c2nnc(C)n2c1
InChI Key InChIKey=FZOWBAIZBAZQAF-UHFFFAOYSA-N
Data  3 IC50
  Tab Delimited (TSV)   2D SDfile   Computed 3D by Vconf -m prep SDfile
Find this compound or compounds like it in BindingDB:
Activity Spreadsheet -- Enzyme Inhibition Constant Data from BindingDB
Found 3 hits for monomerid = 274324
TargetBromodomain-containing protein 4 [44-477](Homo sapiens (Human))
Novartis
US Patent
LigandPNGBDBM274324(Ethyl 6-(4-chlorophenyl)-3-cyclopropyl-5-(3,8-dime...)
Affinity DataIC50:  15nMpH: 7.5Assay Description:All assays were performed in 384-well microtiter plates. Each assay plate contained 8-point serial dilutions for 40 test compounds, plus 16 high- and...
Ligand InfoPC cidPC sid
In DepthDetails US Patent
TargetCREB-binding protein(Homo sapiens (Human))
Novartis
US Patent
LigandPNGBDBM274324(Ethyl 6-(4-chlorophenyl)-3-cyclopropyl-5-(3,8-dime...)
Affinity DataIC50:  1.37E+4nMpH: 7.5 T: 2°C. Assay description: All assays were performed in 384-well microtiter plates. Each assay plate contained 8-point serial dilutions for 40 test compounds, plus 16 high- and...
Ligand InfoPC cidPC sid
In DepthDetails US Patent
TargetBromodomain-containing protein 3(Homo sapiens (Human))
Novartis
US Patent
LigandPNGBDBM274324(Ethyl 6-(4-chlorophenyl)-3-cyclopropyl-5-(3,8-dime...)
Affinity DataIC50:  15nMpH: 7.5Assay Description:All assays were performed in 384-well microtiter plates. Each assay plate contained 8-point serial dilutions for 40 test compounds, plus 16 high- and...
Ligand InfoPC cidPC sid
In DepthDetails US Patent