BDBM274971 N2-(tert-butyl)-N8-quinolin-8-ylmethyl)-5- (3-(trifluoromethyl)phenyl)-3,4- dihydroisoquinoline-2,8(1H)-dicarbox- amide::US9877957, Example 11
SMILES CC(C)(C)NC(=O)N1CCc2c(C1)c(ccc2-c1cccc(c1)C(F)(F)F)C(=O)NCc1cccc2cccnc12
InChI Key InChIKey=MQHMLDKROMLIQP-UHFFFAOYSA-N
Data  1 IC50
  Tab Delimited (TSV)   2D SDfile   Computed 3D by Vconf -m prep SDfile
Find this compound or compounds like it in BindingDB:
Activity Spreadsheet -- Enzyme Inhibition Constant Data from BindingDB
Found 1 hit for monomerid = 274971
TargetDiacylglycerol O-acyltransferase 2(Homo sapiens (Human))
Merck Sharp & Dohme
US Patent
LigandPNGBDBM274971(N2-(tert-butyl)-N8-quinolin-8-ylmethyl)-5- (3-(tri...)
Affinity DataIC50:  67.6nMpH: 7.0 T: 2°C. Assay description: DGAT2 activity was determined by measuring the amount of enzymatic product triolein (1,2,3-Tri(cis-9-octadecenoyl)glycerol) using the membrane prep m...
Ligand InfoPC cidPC sid
In DepthDetails US Patent