BDBM274992 N2-(tert-butyl)-N8-(2-(3,5-dimethyl-1H- pyrazol-1-yl)ethyl)-5-(3- (trifluoromethyl)phenyl)-3,4- dihydroisoquinoline-2,8(1H)-dicarboxamide::US9877957, Example 31
SMILES Cc1cc(C)n(CCNC(=O)c2ccc(-c3cccc(c3)C(F)(F)F)c3CCN(Cc23)C(=O)NC(C)(C)C)n1
InChI Key InChIKey=CMSLCLXQEHJERM-UHFFFAOYSA-N
Data  1 IC50
  Tab Delimited (TSV)   2D SDfile   Computed 3D by Vconf -m prep SDfile
Find this compound or compounds like it in BindingDB:
Activity Spreadsheet -- Enzyme Inhibition Constant Data from BindingDB
Found 1 hit for monomerid = 274992
TargetDiacylglycerol O-acyltransferase 2(Homo sapiens (Human))
Merck Sharp & Dohme
US Patent
LigandPNGBDBM274992(N2-(tert-butyl)-N8-(2-(3,5-dimethyl-1H- pyrazol-1-...)
Affinity DataIC50:  505nMpH: 7.0 T: 2°C. Assay description: DGAT2 activity was determined by measuring the amount of enzymatic product triolein (1,2,3-Tri(cis-9-octadecenoyl)glycerol) using the membrane prep m...
Ligand InfoPC cidPC sid
In DepthDetails US Patent