BDBM274997 N2-(tert-butyl)-N8-(2-morpholino-2-(pyridin- 2-yl)ethyl)-5-(3-(trifluoromethyl)phenyl)- 3,4-dihydroisoquinoline-2,8(1H)- dicarboxamide::US9877957, Example 36
SMILES CC(C)(C)NC(=O)N1CCc2c(C1)c(ccc2-c1cccc(c1)C(F)(F)F)C(=O)NCC(N1CCOCC1)c1ccccn1
InChI Key InChIKey=DHYCSBDOCHEKQM-UHFFFAOYSA-N
Data  1 IC50
  Tab Delimited (TSV)   2D SDfile   Computed 3D by Vconf -m prep SDfile
Find this compound or compounds like it in BindingDB:
Activity Spreadsheet -- Enzyme Inhibition Constant Data from BindingDB
Found 1 hit for monomerid = 274997
TargetDiacylglycerol O-acyltransferase 2(Homo sapiens (Human))
Merck Sharp & Dohme
US Patent
LigandPNGBDBM274997(N2-(tert-butyl)-N8-(2-morpholino-2-(pyridin- 2-yl)...)
Affinity DataIC50:  737nMpH: 7.0 T: 2°C. Assay description: DGAT2 activity was determined by measuring the amount of enzymatic product triolein (1,2,3-Tri(cis-9-octadecenoyl)glycerol) using the membrane prep m...
Ligand InfoPC cidPC sid
In DepthDetails US Patent