BDBM275035 N2-(tert-butyl)-N8-(1-(3-(pyridin-2-yl)-1,2,4- oxadiazol-5-yl)ethyl)-5-(3- (trifluoromethoxy)phenyl)-3,4- dihydroisoquinoline-2,8(1H)-dicarboxamide::US9877957, Example 73
SMILES CC(NC(=O)c1ccc(-c2cccc(OC(F)(F)F)c2)c2CCN(Cc12)C(=O)NC(C)(C)C)c1nc(no1)-c1ccccn1
InChI Key InChIKey=BNCDVHZDTJDLBM-UHFFFAOYSA-N
Data  1 IC50
  Tab Delimited (TSV)   2D SDfile   Computed 3D by Vconf -m prep SDfile
Find this compound or compounds like it in BindingDB:
Activity Spreadsheet -- Enzyme Inhibition Constant Data from BindingDB
Found 1 hit for monomerid = 275035
TargetDiacylglycerol O-acyltransferase 2(Homo sapiens (Human))
Merck Sharp & Dohme
US Patent
LigandPNGBDBM275035(N2-(tert-butyl)-N8-(1-(3-(pyridin-2-yl)-1,2,4- oxa...)
Affinity DataIC50:  511nMpH: 7.0 T: 2°C. Assay description: DGAT2 activity was determined by measuring the amount of enzymatic product triolein (1,2,3-Tri(cis-9-octadecenoyl)glycerol) using the membrane prep m...
Ligand InfoPC cidPC sid
In DepthDetails US Patent