BDBM27648 1-(2-{[(2S)-2-aminopropanamido]methyl}-1-benzofuran-7-yl)-N-[(2-methoxyphenyl)methyl]-3-(trifluoromethyl)-1H-pyrazole-5-carboxamide::pyrazole scaffold, 29
SMILES COc1ccccc1CNC(=O)c1cc(nn1-c1cccc2cc(CNC(=O)[C@H](C)N)oc12)C(F)(F)F
InChI Key InChIKey=PVFDWCOBVPZKGI-AWEZNQCLSA-N
Data  1 IC50
  Tab Delimited (TSV)   2D SDfile   Computed 3D by Vconf -m prep SDfile
Find this compound or compounds like it in BindingDB:
Activity Spreadsheet -- Enzyme Inhibition Constant Data from BindingDB
Found 1 hit for monomerid = 27648
TargetHistone-arginine methyltransferase CARM1(Mus musculus (mouse))
Methylgene
LigandPNGBDBM27648(1-(2-{[(2S)-2-aminopropanamido]methyl}-1-benzofura...)
Affinity DataIC50: >1.00E+4nMpH: 9.0 T: 2°C. Assay description: Histone H3 is used as the substrate for CARM-1 enzyme, and the methylation is monitored using tritiated S-Adenosyl-Methionine (SAM) as a methyl donor...
Ligand InfoKEGGPC cidPC sid
In DepthDetails ArticlePubMed