BDBM278861 2-(3,8- diazabicyclo[3.2.1] oct-3-yl)-N-[3- (difluoromethyl)-1- methyl-1H-pyrazol-4- yl]thieno[2,3-b] pyrazine-7- carboxamide trifluoroacetate::US10040802, Example 40
SMILES OC(=O)C(F)(F)F.Cn1cc(NC(=O)c2csc3ncc(nc23)N2CC3CCC(C2)N3)c(n1)C(F)F
InChI Key InChIKey=FPFDFZVMFBQOGN-UHFFFAOYSA-N
Data  1 IC50
  Tab Delimited (TSV)   2D SDfile   Computed 3D by Vconf -m prep SDfile
Find this compound or compounds like it in BindingDB:
Activity Spreadsheet -- Enzyme Inhibition Constant Data from BindingDB
Found 1 hit for monomerid = 278861
TargetInterleukin-1 receptor-associated kinase 4(Homo sapiens (Human))
Merck Sharp & Dohme
US Patent
LigandPNGBDBM278861(2-(3,8- diazabicyclo[3.2.1] oct-3-yl)-N-[3- (diflu...)
Affinity DataIC50:  0.600nMpH: 7.2Assay Description:The kinase activity of IRAK4 is determined by its ability to catalyze the phosphorylation of a fluorescent polypeptide substrate. The extent of phosp...
Ligand InfoPC cidPC sid
In DepthDetails US Patent