BDBM283999 E25::US10023564, Example 25
SMILES CC1=C(C(NC(=O)N1)c1ccc(F)c(c1)C(=O)NC1CC2CC3(C)C2(C)C13C)C(=O)Nc1ccc2[nH]ncc2c1
InChI Key
Data  3 IC50
  Tab Delimited (TSV)   2D SDfile   Computed 3D by Vconf -m prep SDfile
Find this compound or compounds like it in BindingDB:
Activity Spreadsheet -- Enzyme Inhibition Constant Data from BindingDB
Found 3 hits for monomerid = 283999
TargetRhodopsin kinase GRK1(Homo sapiens (Human))
The Regents of The University of Michigan
US Patent
LigandPNGBDBM283999(E25 | US10023564, Example 25)
Affinity DataIC50: >1.00E+5nMpH: 7.0Assay Description:GRK1, 2 and 5 kinetic assays were conducted in a buffer containing 20 mM HEPES pH 7.0, 5 μM ATP, 2 mM MgCl2, and 0.025% DDM with 50 nM GRK and e...
Ligand InfoPC cidPC sid
In DepthDetails US Patent
TargetG protein-coupled receptor kinase 5(Homo sapiens (Human))
The Regents of The University of Michigan
US Patent
LigandPNGBDBM283999(E25 | US10023564, Example 25)
Affinity DataIC50:  8.90E+4nMpH: 7.0Assay Description:GRK1, 2 and 5 kinetic assays were conducted in a buffer containing 20 mM HEPES pH 7.0, 5 μM ATP, 2 mM MgCl2, and 0.025% DDM with 50 nM GRK and e...
Ligand InfoPC cidPC sid
In DepthDetails US Patent
TargetBeta-adrenergic receptor kinase 1(Homo sapiens (Human))
The Regents of The University of Michigan
US Patent
LigandPNGBDBM283999(E25 | US10023564, Example 25)
Affinity DataIC50:  5.20E+3nMpH: 7.0Assay Description:GRK1, 2 and 5 kinetic assays were conducted in a buffer containing 20 mM HEPES pH 7.0, 5 μM ATP, 2 mM MgCl2, and 0.025% DDM with 50 nM GRK and e...
Ligand InfoPC cidPC sid
In DepthDetails US Patent