BDBM284967 4-[3-(dimethylsulfamoylamino)phenyl]- 2-methyl-1-oxoisoquinoline::US10023592, Example 12::US10941160, Example 12
SMILES CN(C)S(=O)(=O)Nc1cccc(c1)-c1cn(C)c(=O)c2ccccc12
InChI Key InChIKey=LRXYFJZARHSHQC-UHFFFAOYSA-N
Data  3 IC50
  Tab Delimited (TSV)   2D SDfile   Computed 3D by Vconf -m prep SDfile
Find this compound or compounds like it in BindingDB:
Activity Spreadsheet -- Enzyme Inhibition Constant Data from BindingDB
Found 1 hit for monomerid = 284967
TargetBromodomain-containing protein 4(Homo sapiens (Human))
Celgene Quanticel Research
Curated by ChEMBL
LigandPNGBDBM284967(4-[3-(dimethylsulfamoylamino)phenyl]- 2-methyl-1-o...)
Affinity DataIC50:  250nM. Assay description: Inhibition of His-tagged human BRD4-BD1 using H4K5acK8acK12acK16ac as substrate preincubated for 30 mins followed by substrate addition measured afte...
Ligand InfoPC cidPC sid
In DepthDetails ArticlePubMed