BDBM284984 N-[3-(2-methyl-1-oxoisoquinolin-4-yl) phenyl]butane-1-sulfonamide::US10023592, Example 29::US10941160, Example 29
SMILES CCCCS(=O)(=O)Nc1cccc(c1)-c1cn(C)c(=O)c2ccccc12
InChI Key InChIKey=HMKYYADNFMZACZ-UHFFFAOYSA-N
Data  3 IC50
  Tab Delimited (TSV)   2D SDfile   Computed 3D by Vconf -m prep SDfile
Find this compound or compounds like it in BindingDB:
Activity Spreadsheet -- Enzyme Inhibition Constant Data from BindingDB
Found 3 hits for monomerid = 284984
TargetBromodomain-containing protein 4(Homo sapiens (Human))
Celgene Quanticel Research
US Patent
LigandPNGBDBM284984(N-[3-(2-methyl-1-oxoisoquinolin-4-yl) phenyl]butan...)
Affinity DataIC50: <500nMpH: 7.3Assay Description:Determination of the IC50 for the heterocyclic derivative BRD4 inhibitors disclosed herein was performed as follows. His-tagged BRD4 was cloned, expr...
Ligand InfoPC cidPC sid
In DepthDetails US Patent
TargetBromodomain-containing protein 4(Homo sapiens (Human))
Celgene Quanticel Research
US Patent
LigandPNGBDBM284984(N-[3-(2-methyl-1-oxoisoquinolin-4-yl) phenyl]butan...)
Affinity DataIC50: <500nM. Assay description: Determination of the IC50 for the heterocyclic derivative BRD4 inhibitors disclosed herein was performed as follows. His-tagged BRD4 was cloned, expr...
Ligand InfoPC cidPC sid
In DepthDetails US Patent
TargetBromodomain-containing protein 4(Homo sapiens (Human))
Celgene Quanticel Research
US Patent
LigandPNGBDBM284984(N-[3-(2-methyl-1-oxoisoquinolin-4-yl) phenyl]butan...)
Affinity DataIC50:  420nM. Assay description: Inhibition of His-tagged human BRD4-BD1 using H4K5acK8acK12acK16ac as substrate preincubated for 30 mins followed by substrate addition measured afte...
Ligand InfoPC cidPC sid
In DepthDetails ArticlePubMed