BDBM286286 US9518026, Example 79::US9956214, Compound 1646
SMILES NC(=O)c1c(N)n(nc1-c1ccc2nc(OC3CCC3)ccc2c1)C1CCCCC1
InChI Key InChIKey=ZCXUCDWNAIZDKS-UHFFFAOYSA-N
Data  4 IC50
  Tab Delimited (TSV)   2D SDfile   Computed 3D by Vconf -m prep SDfile
Find this compound or compounds like it in BindingDB:
Activity Spreadsheet -- Enzyme Inhibition Constant Data from BindingDB
Found 4 hits for monomerid = 286286
TargetCalmodulin-domain protein kinase 1(Toxoplasma gondii)
University of Washington Through Its Center For Commercialization
US Patent
LigandPNGBDBM286286(US9518026, Example 79 | US9956214, Compound 1646)
Affinity DataIC50:  12nM. Assay description: Inhibition of TgCDPK1 and CpCDPK1 was determined using a luminescent kinase assay which measures ATP depletion in the presence of the Syntide 2 pepti...
Ligand InfoPC cidPC sid
In DepthDetails US Patent
TargetCalcium-dependent protein kinase 1(Cryptosporidium parvum)
University of Washington Through Its Center For Commercialization
US Patent
LigandPNGBDBM286286(US9518026, Example 79 | US9956214, Compound 1646)
Affinity DataIC50:  13nM. Assay description: Inhibition of TgCDPK1 and CpCDPK1 was determined using a luminescent kinase assay which measures ATP depletion in the presence of the Syntide 2 pepti...
Ligand InfoPC cidPC sid
In DepthDetails US Patent
TargetCalmodulin-domain protein kinase 1(Toxoplasma gondii)
University of Washington Through Its Center For Commercialization
US Patent
LigandPNGBDBM286286(US9518026, Example 79 | US9956214, Compound 1646)
Affinity DataIC50:  16nM. Assay description: Inhibition of TgCDPK1 and CpCDPK1 was determined using a luminescent kinase assay which measures ATP depletion in the presence of the Syntide 2 pepti...
Ligand InfoPC cidPC sid
In DepthDetails US Patent
TargetUncharacterized protein(Cryptosporidium parvum)
University of Washington Through Its Center For Commercialization
US Patent
LigandPNGBDBM286286(US9518026, Example 79 | US9956214, Compound 1646)
Affinity DataIC50:  6nM. Assay description: Inhibition of TgCDPK1 and CpCDPK1 was determined using a luminescent kinase assay which measures ATP depletion in the presence of the Syntide 2 pepti...
Ligand InfoPC cidPC sid
In DepthDetails US Patent