BDBM286291 5-amino-1-(tert-butyl)-3-(7- (neopentyloxy)quinolin-3-yl)-1H- pyrazole-4-carboxamide MS (ESI) (M + H)+ = 396.6::US9518026, Example 84::US9956214, Compound 1587
SMILES CC(C)(C)COc1ccc2cc(cnc2c1)-c1nn(c(N)c1C(N)=O)C(C)(C)C
InChI Key InChIKey=YMNGGNWWZGVESF-UHFFFAOYSA-N
Data  4 IC50
  Tab Delimited (TSV)   2D SDfile   Computed 3D by Vconf -m prep SDfile
Find this compound or compounds like it in BindingDB:
Activity Spreadsheet -- Enzyme Inhibition Constant Data from BindingDB
Found 4 hits for monomerid = 286291
TargetCalmodulin-domain protein kinase 1(Toxoplasma gondii)
University of Washington Through Its Center For Commercialization
US Patent
LigandPNGBDBM286291(5-amino-1-(tert-butyl)-3-(7- (neopentyloxy)quinoli...)
Affinity DataIC50:  258nM. Assay description: Inhibition of TgCDPK1 and CpCDPK1 was determined using a luminescent kinase assay which measures ATP depletion in the presence of the Syntide 2 pepti...
Ligand InfoPC cidPC sid
In DepthDetails US Patent
TargetCalcium-dependent protein kinase 1(Cryptosporidium parvum)
University of Washington Through Its Center For Commercialization
US Patent
LigandPNGBDBM286291(5-amino-1-(tert-butyl)-3-(7- (neopentyloxy)quinoli...)
Affinity DataIC50:  490nM. Assay description: Inhibition of TgCDPK1 and CpCDPK1 was determined using a luminescent kinase assay which measures ATP depletion in the presence of the Syntide 2 pepti...
Ligand InfoPC cidPC sid
In DepthDetails US Patent
TargetCalmodulin-domain protein kinase 1(Toxoplasma gondii)
University of Washington Through Its Center For Commercialization
US Patent
LigandPNGBDBM286291(5-amino-1-(tert-butyl)-3-(7- (neopentyloxy)quinoli...)
Affinity DataIC50:  175nM. Assay description: Inhibition of TgCDPK1 and CpCDPK1 was determined using a luminescent kinase assay which measures ATP depletion in the presence of the Syntide 2 pepti...
Ligand InfoPC cidPC sid
In DepthDetails US Patent
TargetUncharacterized protein(Cryptosporidium parvum)
University of Washington Through Its Center For Commercialization
US Patent
LigandPNGBDBM286291(5-amino-1-(tert-butyl)-3-(7- (neopentyloxy)quinoli...)
Affinity DataIC50:  255nM. Assay description: Inhibition of TgCDPK1 and CpCDPK1 was determined using a luminescent kinase assay which measures ATP depletion in the presence of the Syntide 2 pepti...
Ligand InfoPC cidPC sid
In DepthDetails US Patent