BDBM287022 (8-(3-(4-acryloylpiperazin-1-yl)propyl)-6-(2,6-dichloro-3,5-dimethoxyphenyl)-2-((1,3-dimethoxypropan-2-yl)amino)pyrido[2,3-d]pyrimidin-7(8H)-one::US10294223, Cpd No. 57::US11078199, Cpd 57::US9567334, Example 57::US9815834, Compound 57
SMILES COCC(COC)Nc1ncc2cc(-c3c(Cl)c(OC)cc(OC)c3Cl)c(=O)n(CCCN3CCN(CC3)C(=O)C=C)c2n1
InChI Key InChIKey=KCIGGSIEQASIPY-UHFFFAOYSA-N
Data  5 IC50
  Tab Delimited (TSV)   2D SDfile   Computed 3D by Vconf -m prep SDfile
Find this compound or compounds like it in BindingDB:
Activity Spreadsheet -- Enzyme Inhibition Constant Data from BindingDB
Found 5 hits for monomerid = 287022
TargetFibroblast growth factor receptor 1(Homo sapiens (Human))
Principia Biopharma
US Patent
LigandPNGBDBM287022((8-(3-(4-acryloylpiperazin-1-yl)propyl)-6-(2,6-dic...)
Affinity DataIC50:  1.40nMT: 2°C. Assay description: A Caliper-based kinase assay (Caliper Life Sciences, Hopkinton, Mass.) was used to measure inhibition of FGFR family (FGFR1, FGFR2, FGFR3, FGFR4) kin...
Ligand InfoPC cidPC sid
In DepthDetails US Patent
TargetFibroblast growth factor receptor 1(Homo sapiens (Human))
Principia Biopharma
US Patent
LigandPNGBDBM287022((8-(3-(4-acryloylpiperazin-1-yl)propyl)-6-(2,6-dic...)
Affinity DataIC50:  1.40nM. Assay description: A Caliper-based kinase assay (Caliper Life Sciences, Hopkinton, Mass.) was used to measure inhibition of FGFR family (FGFR1, FGFR2, FGFR3, FGFR4) kin...
Ligand InfoPC cidPC sid
In DepthDetails US Patent
TargetFibroblast growth factor receptor 1(Homo sapiens (Human))
Principia Biopharma
US Patent
LigandPNGBDBM287022((8-(3-(4-acryloylpiperazin-1-yl)propyl)-6-(2,6-dic...)
Affinity DataIC50:  1.40nM. Assay description: A Caliper-based kinase assay (Caliper Life Sciences, Hopkinton, Mass.) was used to measure inhibition of FGFR family (FGFR1, FGFR2, FGFR3, FGFR4) kin...
Ligand InfoPC cidPC sid
In DepthDetails US Patent
TargetFibroblast growth factor receptor 1(Homo sapiens (Human))
Principia Biopharma
US Patent
LigandPNGBDBM287022((8-(3-(4-acryloylpiperazin-1-yl)propyl)-6-(2,6-dic...)
Affinity DataIC50:  12.8nM. Assay description: A Caliper-based kinase assay (Caliper Life Sciences, Hopkinton, Mass.) was used to measure inhibition of FGFR family (FGFR1, FGFR2, FGFR3, FGFR4) kin...
Ligand InfoPC cidPC sid
In DepthDetails US Patent
TargetFibroblast growth factor receptor 2(Homo sapiens (Human))
Principia Biopharma
US Patent
LigandPNGBDBM287022((8-(3-(4-acryloylpiperazin-1-yl)propyl)-6-(2,6-dic...)
Affinity DataIC50:  12.8nM. Assay description: The cell-based effects of FGFR inhibitors were determined by measuring inhibition of FGFR-dependent cell line growth. The cell lines SNU-16 was used ...
Ligand InfoPC cidPC sid
In DepthDetails US Patent