BDBM287063 8-(3-(4-acryloylpiperazin-1-yl)propyl)-6-(2-chloro-6-fluoro-3,5-dimethoxyphenyl)-2-(methylamino)pyrido[2,3-d]pyrimidin-7(8H)-one::US10294223, Cpd No. 68::US11078199, Cpd 68::US9567334, Example 68
SMILES CNc1ncc2cc(-c3c(F)c(OC)cc(OC)c3Cl)c(=O)n(CCCN3CCN(CC3)C(=O)C=C)c2n1
InChI Key InChIKey=YOKHYCKWYHSRCY-UHFFFAOYSA-N
Data  3 IC50
  Tab Delimited (TSV)   2D SDfile   Computed 3D by Vconf -m prep SDfile
Find this compound or compounds like it in BindingDB:
Activity Spreadsheet -- Enzyme Inhibition Constant Data from BindingDB
Found 3 hits for monomerid = 287063
TargetFibroblast growth factor receptor 1(Homo sapiens (Human))
Principia Biopharma
US Patent
LigandPNGBDBM287063(8-(3-(4-acryloylpiperazin-1-yl)propyl)-6-(2-chloro...)
Affinity DataIC50:  1nMT: 2°C. Assay description: A Caliper-based kinase assay (Caliper Life Sciences, Hopkinton, Mass.) was used to measure inhibition of FGFR family (FGFR1, FGFR2, FGFR3, FGFR4) kin...
Ligand InfoPC cidPC sid
In DepthDetails US Patent
TargetFibroblast growth factor receptor 1(Homo sapiens (Human))
Principia Biopharma
US Patent
LigandPNGBDBM287063(8-(3-(4-acryloylpiperazin-1-yl)propyl)-6-(2-chloro...)
Affinity DataIC50:  1nM. Assay description: A Caliper-based kinase assay (Caliper Life Sciences, Hopkinton, Mass.) was used to measure inhibition of FGFR family (FGFR1, FGFR2, FGFR3, FGFR4) kin...
Ligand InfoPC cidPC sid
In DepthDetails US Patent
TargetFibroblast growth factor receptor 1(Homo sapiens (Human))
Principia Biopharma
US Patent
LigandPNGBDBM287063(8-(3-(4-acryloylpiperazin-1-yl)propyl)-6-(2-chloro...)
Affinity DataIC50:  1nM. Assay description: A Caliper-based kinase assay (Caliper Life Sciences, Hopkinton, Mass.) was used to measure inhibition of FGFR family (FGFR1, FGFR2, FGFR3, FGFR4) kin...
Ligand InfoPC cidPC sid
In DepthDetails US Patent