BDBM28708 2-methyl-2-phenoxypropanoic acid, 34::2-methyl-2-{4-[({4-methyl-2-[4-(trifluoromethyl)phenyl]-1,3-thiazol-5-yl}methyl)carbamoyl]phenoxy}propanoic acid
SMILES Cc1nc(sc1CNC(=O)c1ccc(OC(C)(C)C(O)=O)cc1)-c1ccc(cc1)C(F)(F)F
InChI Key InChIKey=FLNMIIWQNDDAQK-UHFFFAOYSA-N
Data  3 EC50
  Tab Delimited (TSV)   2D SDfile   Computed 3D by Vconf -m prep SDfile
Find this compound or compounds like it in BindingDB:
Activity Spreadsheet -- Enzyme Inhibition Constant Data from BindingDB
Found 3 hits for monomerid = 28708
LigandPNGBDBM28708(2-methyl-2-phenoxypropanoic acid, 34 | 2-methyl-2-...)
Affinity DataEC50:  1.32E+3nM. Assay description: The ligand binding domain for PPAR was fused to the yeast transcription factor GAL4 DNA binding domain. CV-1 cells were transiently transfected with ...
In DepthDetails ArticlePubMed
LigandPNGBDBM28708(2-methyl-2-phenoxypropanoic acid, 34 | 2-methyl-2-...)
Affinity DataEC50: >1.00E+4nM. Assay description: The ligand binding domain for PPAR was fused to the yeast transcription factor GAL4 DNA binding domain. CV-1 cells were transiently transfected with ...
In DepthDetails ArticlePubMed
LigandPNGBDBM28708(2-methyl-2-phenoxypropanoic acid, 34 | 2-methyl-2-...)
Affinity DataEC50:  6.26E+3nM. Assay description: The ligand binding domain for PPAR was fused to the yeast transcription factor GAL4 DNA binding domain. CV-1 cells were transiently transfected with ...
In DepthDetails ArticlePubMed