BDBM287097 N-(1-(2-(Azepan-1- yl)ethyl)-1H-pyrazolo[3,4- d]pyrimidin-4- yl)cyclohexanecarboxamide maleate::US9567338, 15
SMILES O=C(Nc1ncnc2n(CCN3CCCCCC3)ncc12)C1CCCCC1
InChI Key InChIKey=OTXFTSZZTMLEKQ-UHFFFAOYSA-N
Data  1 KI
  Tab Delimited (TSV)   2D SDfile   Computed 3D by Vconf -m prep SDfile
Find this compound or compounds like it in BindingDB:
Activity Spreadsheet -- Enzyme Inhibition Constant Data from BindingDB
Found 1 hit for monomerid = 287097
TargetSigma non-opioid intracellular receptor 1(Cavia porcellus (Guinea pig))
Laboratorios Del Dr. Esteve
US Patent
LigandPNGBDBM287097(N-(1-(2-(Azepan-1- yl)ethyl)-1H-pyrazolo[3,4- d]py...)
Affinity DataKi:  13.1nMpH: 7.4Assay Description:Brain membrane preparation and binding assays for the σ1-receptor were performed as described (DeHaven-Hudkins, D. L., L. C. Fleissner, and F. Y...
Ligand InfoPC cidPC sid
In DepthDetails US Patent