BDBM287123 1-Adamanthyl-3-(1-(2- (piperidin-1-yl)ethyl)-1H- pyrazolo[3,4- d]pyrimidin-4-yl)urea hydrochloride::US9567338, 56
SMILES O=C(Nc1ncnc2n(CCN3CCCCC3)ncc12)NC12CC3CC(CC(C3)C1)C2
InChI Key InChIKey=OHDSERAUEDNIPZ-UHFFFAOYSA-N
Data  1 KI
  Tab Delimited (TSV)   2D SDfile   Computed 3D by Vconf -m prep SDfile
Find this compound or compounds like it in BindingDB:
Activity Spreadsheet -- Enzyme Inhibition Constant Data from BindingDB
Found 1 hit for monomerid = 287123
TargetSigma non-opioid intracellular receptor 1(Cavia porcellus (Guinea pig))
Laboratorios Del Dr. Esteve
US Patent
LigandPNGBDBM287123(1-Adamanthyl-3-(1-(2- (piperidin-1-yl)ethyl)-1H- p...)
Affinity DataKi:  182nMpH: 7.4Assay Description:Brain membrane preparation and binding assays for the σ1-receptor were performed as described (DeHaven-Hudkins, D. L., L. C. Fleissner, and F. Y...
Ligand InfoPC cidPC sid
In DepthDetails US Patent