BDBM287129 1-(1-(2-(azepan-1- yl)ethyl)-1H- pyrazolo[3,4- d]pyrimidin-4-yl)-3- propylurea maleate::US9567338, 66
SMILES CCCNC(=O)Nc1ncnc2n(CCN3CCCCCC3)ncc12
InChI Key InChIKey=XYKWQTFEUOCNEB-UHFFFAOYSA-N
Data  1 KI
  Tab Delimited (TSV)   2D SDfile   Computed 3D by Vconf -m prep SDfile
Find this compound or compounds like it in BindingDB:
Activity Spreadsheet -- Enzyme Inhibition Constant Data from BindingDB
Found 1 hit for monomerid = 287129
TargetSigma non-opioid intracellular receptor 1(Cavia porcellus (Guinea pig))
Laboratorios Del Dr. Esteve
US Patent
LigandPNGBDBM287129(1-(1-(2-(azepan-1- yl)ethyl)-1H- pyrazolo[3,4- d]p...)
Affinity DataKi:  24nMpH: 7.4Assay Description:Brain membrane preparation and binding assays for the σ1-receptor were performed as described (DeHaven-Hudkins, D. L., L. C. Fleissner, and F. Y...
Ligand InfoPC cidPC sid
In DepthDetails US Patent