BDBM287140 N-(1-(2-(4-tert- butylpiperidin-1-yl)ethyl)- 1H-pyrazolo[3,4- d]pyrimidin-4- yl)pivalamide::US9567338, 82
SMILES CC(C)(C)C1CCN(CCn2ncc3c(NC(=O)C(C)(C)C)ncnc23)CC1
InChI Key InChIKey=UKNZGXIABNKLCS-UHFFFAOYSA-N
Data  1 KI
  Tab Delimited (TSV)   2D SDfile   Computed 3D by Vconf -m prep SDfile
Find this compound or compounds like it in BindingDB:
Activity Spreadsheet -- Enzyme Inhibition Constant Data from BindingDB
Found 1 hit for monomerid = 287140
TargetSigma non-opioid intracellular receptor 1(Cavia porcellus (Guinea pig))
Laboratorios Del Dr. Esteve
US Patent
LigandPNGBDBM287140(N-(1-(2-(4-tert- butylpiperidin-1-yl)ethyl)- 1H-py...)
Affinity DataKi:  12.2nMpH: 7.4Assay Description:Brain membrane preparation and binding assays for the σ1-receptor were performed as described (DeHaven-Hudkins, D. L., L. C. Fleissner, and F. Y...
Ligand InfoPC cidPC sid
In DepthDetails US Patent