BDBM28716 2-methyl-2-(4-{[(4-methyl-2-phenyl-1,3-thiazol-5-yl)formamido]methyl}phenoxy)propanoic acid::2-methyl-2-phenoxypropanoic acid, 25h
SMILES Cc1nc(sc1C(=O)NCc1ccc(OC(C)(C)C(O)=O)cc1)-c1ccccc1
InChI Key InChIKey=NMTNWMOGBNXARY-UHFFFAOYSA-N
Data  3 EC50
  Tab Delimited (TSV)   2D SDfile   Computed 3D by Vconf -m prep SDfile
Find this compound or compounds like it in BindingDB:
Activity Spreadsheet -- Enzyme Inhibition Constant Data from BindingDB
Found 3 hits for monomerid = 28716
LigandPNGBDBM28716(2-methyl-2-(4-{[(4-methyl-2-phenyl-1,3-thiazol-5-y...)
Affinity DataEC50:  120nM. Assay description: The ligand binding domain for PPAR was fused to the yeast transcription factor GAL4 DNA binding domain. CV-1 cells were transiently transfected with ...
In DepthDetails ArticlePubMed
LigandPNGBDBM28716(2-methyl-2-(4-{[(4-methyl-2-phenyl-1,3-thiazol-5-y...)
Affinity DataEC50: >1.00E+4nM. Assay description: The ligand binding domain for PPAR was fused to the yeast transcription factor GAL4 DNA binding domain. CV-1 cells were transiently transfected with ...
In DepthDetails ArticlePubMed
LigandPNGBDBM28716(2-methyl-2-(4-{[(4-methyl-2-phenyl-1,3-thiazol-5-y...)
Affinity DataEC50: >1.00E+4nM. Assay description: The ligand binding domain for PPAR was fused to the yeast transcription factor GAL4 DNA binding domain. CV-1 cells were transiently transfected with ...
In DepthDetails ArticlePubMed