BDBM28751 2-methyl-2-{2-methyl-4-[({3-[4-(trifluoromethoxy)phenyl]-1,2,4-thiadiazol-5-yl}methyl)sulfanyl]phenoxy}propanoic acid::[1,2,4]thiadiazole derivative, 24
SMILES Cc1cc(SCc2nc(ns2)-c2ccc(OC(F)(F)F)cc2)ccc1OC(C)(C)C(O)=O
InChI Key InChIKey=IYNGJYKTRDXUDJ-UHFFFAOYSA-N
Data  6 EC50
  Tab Delimited (TSV)   2D SDfile   Computed 3D by Vconf -m prep SDfile
Find this compound or compounds like it in BindingDB:
Activity Spreadsheet -- Enzyme Inhibition Constant Data from BindingDB
Found 6 hits for monomerid = 28751
TargetPeroxisome proliferator-activated receptor alpha(Homo sapiens (Human))
Johnson & Johnson Pharmaceutical
LigandPNGBDBM28751(2-methyl-2-{2-methyl-4-[({3-[4-(trifluoromethoxy)p...)
Affinity DataEC50:  33nM. Assay description: The HEK293 cells were co-transfected with DNA constructs containing the ligand-binding domain of PPAR and Gal4-luciferase reporter. The luciferase ac...
In DepthDetails ArticlePubMed
TargetPeroxisome proliferator-activated receptor gamma(Homo sapiens (Human))
Johnson & Johnson Pharmaceutical
LigandPNGBDBM28751(2-methyl-2-{2-methyl-4-[({3-[4-(trifluoromethoxy)p...)
Affinity DataEC50: >3.00E+3nM. Assay description: The HEK293 cells were co-transfected with DNA constructs containing the ligand-binding domain of PPAR and Gal4-luciferase reporter. The luciferase ac...
In DepthDetails ArticlePubMed
TargetPeroxisome proliferator-activated receptor gamma(Homo sapiens (Human))
Johnson & Johnson Pharmaceutical
LigandPNGBDBM28751(2-methyl-2-{2-methyl-4-[({3-[4-(trifluoromethoxy)p...)
Affinity DataEC50: >3.00E+3nM. Assay description: Agonist activity at human PPARgamma-Gal4 in HEK293 cells by luciferase reporter assay
In DepthDetails ArticlePubMed
TargetPeroxisome proliferator-activated receptor alpha(Homo sapiens (Human))
Johnson & Johnson Pharmaceutical
LigandPNGBDBM28751(2-methyl-2-{2-methyl-4-[({3-[4-(trifluoromethoxy)p...)
Affinity DataEC50:  33nM. Assay description: Agonist activity at human PPARalpha-Gal4 in HEK293 cells by luciferase reporter assay
In DepthDetails ArticlePubMed
TargetPeroxisome proliferator-activated receptor delta(Homo sapiens (Human))
Johnson & Johnson Pharmaceutical Research And Development
Curated by ChEMBL
LigandPNGBDBM28751(2-methyl-2-{2-methyl-4-[({3-[4-(trifluoromethoxy)p...)
Affinity DataEC50:  3nM. Assay description: Agonist activity at human PPARdelta-Gal4 in HEK293 cells by luciferase reporter assay
In DepthDetails ArticlePubMed
TargetPeroxisome proliferator-activated receptor delta(Homo sapiens (Human))
Johnson & Johnson Pharmaceutical Research And Development
Curated by ChEMBL
LigandPNGBDBM28751(2-methyl-2-{2-methyl-4-[({3-[4-(trifluoromethoxy)p...)
Affinity DataEC50:  3nM. Assay description: The confluent HEK293 cells were co-transfected with DNA construct containing PPARdelta-Gal4 chimeric receptor and Gal4-luciferase reporter. The lucif...
In DepthDetails ArticlePubMed