BDBM287551 1-(3-(4-acryloylpiperazin-1-yl)propyl)-3-(2,6-dichloro-3,5-dimethoxyphenyl)-7-(ethylamino)-1,6-naphthyridin-2(1H)-one::US11078199, Cpd 147::US9567334, Example 147
SMILES CCNc1cc2n(CCCN3CCN(CC3)C(=O)C=C)c(=O)c(cc2cn1)-c1c(Cl)c(OC)cc(OC)c1Cl
InChI Key InChIKey=NSTXNCRIBVEDMS-UHFFFAOYSA-N
Data  2 IC50
  Tab Delimited (TSV)   2D SDfile   Computed 3D by Vconf -m prep SDfile
Find this compound or compounds like it in BindingDB:
Activity Spreadsheet -- Enzyme Inhibition Constant Data from BindingDB
Found 2 hits for monomerid = 287551
TargetFibroblast growth factor receptor 1(Homo sapiens (Human))
Principia Biopharma
US Patent
LigandPNGBDBM287551(1-(3-(4-acryloylpiperazin-1-yl)propyl)-3-(2,6-dich...)
Affinity DataIC50:  1.30nM. Assay description: A Caliper-based kinase assay (Caliper Life Sciences, Hopkinton, Mass.) was used to measure inhibition of FGFR family (FGFR1, FGFR2, FGFR3, FGFR4) kin...
Ligand InfoPC cidPC sid
In DepthDetails US Patent
TargetFibroblast growth factor receptor 1(Homo sapiens (Human))
Principia Biopharma
US Patent
LigandPNGBDBM287551(1-(3-(4-acryloylpiperazin-1-yl)propyl)-3-(2,6-dich...)
Affinity DataIC50:  1.30nMT: 2°C. Assay description: A Caliper-based kinase assay (Caliper Life Sciences, Hopkinton, Mass.) was used to measure inhibition of FGFR family (FGFR1, FGFR2, FGFR3, FGFR4) kin...
Ligand InfoPC cidPC sid
In DepthDetails US Patent