BDBM288693 US10092551, Example 1::US10092551, Example 26
SMILES C\C(=C1\SC(=NC1=O)N1CCC2(CC1)OCc1ccccc21)c1ccc(Cl)cc1
InChI Key InChIKey=ZDRHWGCUJHNNAJ-HKWRFOASSA-N
Data  2 KI
  Tab Delimited (TSV)   2D SDfile   Computed 3D by Vconf -m prep SDfile
Find this compound or compounds like it in BindingDB:
Activity Spreadsheet -- Enzyme Inhibition Constant Data from BindingDB
Found 2 hits for monomerid = 288693
TargetVasopressin V1a receptor(Homo sapiens (Human))
Hoffmann-La Roche
US Patent
LigandPNGBDBM288693(US10092551, Example 1 | US10092551, Example 26)
Affinity DataKi:  0.631nM ΔG°:  -12.5kcal/moleT: 2°C. Assay description: The human V1a receptor was cloned by RT-PCR from total human liver RNA. The coding sequence was subcloned in an expression vector after sequencing to...
Ligand InfoPC cidPC sid
In DepthDetails US Patent
TargetVasopressin V1a receptor(Homo sapiens (Human))
Hoffmann-La Roche
US Patent
LigandPNGBDBM288693(US10092551, Example 1 | US10092551, Example 26)
Affinity DataKi:  1.26nM ΔG°:  -12.1kcal/moleT: 2°C. Assay description: The human V1a receptor was cloned by RT-PCR from total human liver RNA. The coding sequence was subcloned in an expression vector after sequencing to...
Ligand InfoPC cidPC sid
In DepthDetails US Patent