BDBM288727 US10092551, Example 35
SMILES C\C(=C1\SC(=NC1=O)N1CCC2(CC1)OCc1ccccc21)c1ccco1
InChI Key InChIKey=ZMPMZFJNAZPEBF-JXAWBTAJSA-N
Data  1 KI
  Tab Delimited (TSV)   2D SDfile   Computed 3D by Vconf -m prep SDfile
Find this compound or compounds like it in BindingDB:
Activity Spreadsheet -- Enzyme Inhibition Constant Data from BindingDB
Found 1 hit for monomerid = 288727
TargetVasopressin V1a receptor(Homo sapiens (Human))
Hoffmann-La Roche
US Patent
LigandPNGBDBM288727(US10092551, Example 35)
Affinity DataKi:  1.26nM ΔG°:  -12.1kcal/moleT: 2°C. Assay description: The human V1a receptor was cloned by RT-PCR from total human liver RNA. The coding sequence was subcloned in an expression vector after sequencing to...
Ligand InfoPC cidPC sid
In DepthDetails US Patent