BDBM289775 US10093673, Compound 5.1
SMILES COCCCOc1cc2[C@@H]3CCC(C)(C)[C@@H]3n3cc(C(O)=O)c(=O)cc3-c2cc1Cl
InChI Key InChIKey=IGRNSVPHXIKFRW-YEJXKQKISA-N
Data  1 EC50
  Tab Delimited (TSV)   2D SDfile   Computed 3D by Vconf -m prep SDfile
Find this compound or compounds like it in BindingDB:
Activity Spreadsheet -- Enzyme Inhibition Constant Data from BindingDB
Found 1 hit for monomerid = 289775
TargetLarge envelope protein(Hepatitis B virus)
Novartis
US Patent
LigandPNGBDBM289775(US10093673, Compound 5.1)
Affinity DataEC50:  6nM. Assay description: HepG2-Clone42 cells were seeded in into black clear-bottom 96-well plates at a concentration of 6.0×104 cells/well. 24 hours post-seeding, the cells ...
Ligand InfoPC cidPC sid
In DepthDetails US Patent