BDBM290138 US9572811, Example 18A
SMILES Nc1ncnc2n(nc(-c3ccc(Oc4cccc(F)c4F)cc3)c12)[C@@H]1CCCN(C1)C(=O)C(=CC1CC1)[N+]#[C-]
InChI Key InChIKey=JIJBWPMPPUXCNW-LJQANCHMSA-N
Data  1 IC50
  Tab Delimited (TSV)   2D SDfile   Computed 3D by Vconf -m prep SDfile
Find this compound or compounds like it in BindingDB:
Activity Spreadsheet -- Enzyme Inhibition Constant Data from BindingDB
Found 1 hit for monomerid = 290138
TargetTyrosine-protein kinase BTK(Homo sapiens (Human))
Principia Biopharma
US Patent
LigandPNGBDBM290138(US9572811, Example 18A)
Affinity DataIC50:  2.30nMT: 2°C. Assay description: A Caliper-based kinase assay (Caliper Life Sciences, Hopkinton, Mass.) was used to measure inhibition of Btk kinase activity of a compound of Formula...
Ligand InfoPC cidPC sid
In DepthDetails US Patent