BDBM290262 10-Chloro-4-(piperidin-4-yl)pyrimido[1,2-b]indazol-2(1H)-one hydrochloride::US10098883, Example 3::US10098883, Example 66::US10668071, Example 66
SMILES Clc1cccc2nn3c(cc(=O)[nH]c3c12)C1CCNCC1
InChI Key InChIKey=JCSOBBNZRLXNCX-UHFFFAOYSA-N
Data  4 IC50
  Tab Delimited (TSV)   2D SDfile   Computed 3D by Vconf -m prep SDfile
Find this compound or compounds like it in BindingDB:
Activity Spreadsheet -- Enzyme Inhibition Constant Data from BindingDB
Found 4 hits for monomerid = 290262
TargetPlasminogen [101-181](Homo sapiens (Human))
Bayer Pharma Aktiengesellschaft
US Patent
LigandPNGBDBM290262(10-Chloro-4-(piperidin-4-yl)pyrimido[1,2-b]indazol...)
Affinity DataIC50:  28nMpH: 7.0Assay Description:The test compounds were dissolved in 1% acetic acid and further complemented with an equal volume of DMSO. The resulting stock solutions were seriall...
Ligand InfoPC cidPC sid
In DepthDetails US Patent
TargetPlasminogen [101-181](Homo sapiens (Human))
Bayer Pharma Aktiengesellschaft
US Patent
LigandPNGBDBM290262(10-Chloro-4-(piperidin-4-yl)pyrimido[1,2-b]indazol...)
Affinity DataIC50:  15nM. Assay description: The clot-lysis test system configures the kinetics of clot formation and degradation in vitro and allows quantifying modulation of the process by sel...
Ligand InfoPC cidPC sid
In DepthDetails US Patent
TargetPlasminogen [101-181](Homo sapiens (Human))
Bayer Pharma Aktiengesellschaft
US Patent
LigandPNGBDBM290262(10-Chloro-4-(piperidin-4-yl)pyrimido[1,2-b]indazol...)
Affinity DataIC50:  28nM. Assay description: The clot-lysis test system configures the kinetics of clot formation and degradation in vitro and allows quantifying modulation of the process by sel...
Ligand InfoPC cidPC sid
In DepthDetails US Patent
TargetPlasminogen [101-181](Homo sapiens (Human))
Bayer Pharma Aktiengesellschaft
US Patent
LigandPNGBDBM290262(10-Chloro-4-(piperidin-4-yl)pyrimido[1,2-b]indazol...)
Affinity DataIC50:  15nMpH: 7.0Assay Description:The test compounds were dissolved in 1% acetic acid and further complemented with an equal volume of DMSO. The resulting stock solutions were seriall...
Ligand InfoPC cidPC sid
In DepthDetails US Patent