BDBM294238 N-((1R,3r)-3-((7S,8R)-7-(azetidin-1-yl)-8-benzyl-5,6,7,8-tetrahydronaphthalen-2-yl)cyclobutyl)-1-methyl-1H-imidazole-4-sulfonamide::US9586942, 12
SMILES Cn1cnc(c1)S(=O)(=O)N[C@H]1C[C@@H](C1)c1ccc2CC[C@@H]([C@H](Cc3ccccc3)c2c1)N1CCC1
InChI Key InChIKey=QCZRFLLQRUGNIB-RSQMYVMBSA-N
Data  1 KI
  Tab Delimited (TSV)   2D SDfile   Computed 3D by Vconf -m prep SDfile
Find this compound or compounds like it in BindingDB:
Activity Spreadsheet -- Enzyme Inhibition Constant Data from BindingDB
Found 1 hit for monomerid = 294238
TargetAlpha-1,3-mannosyl-glycoprotein 2-beta-N-acetylglucosaminyltransferase(Homo sapiens (Human))
Abbvie Deutschland
US Patent
LigandPNGBDBM294238(N-((1R,3r)-3-((7S,8R)-7-(azetidin-1-yl)-8-benzyl-5...)
Affinity DataKi: <10nM. Assay description: Human GlyT1c expressing recombinant hGlyT1c_5_CHO cells were plated at 20,000 cells per well in 96 well Cytostar-T scintillation microplates (Amersha...
Ligand InfoPC cidPC sid
In DepthDetails US Patent